Target
Coagulation factor X
Ligand
BDBM50072859
Substrate
Meas. Tech.
ChEMBL_48483 (CHEMBL662061)
Ki
95000±n/a nM
Citation
 Renatus, MBode, WHuber, RStürzebecher, JStubbs, MT Structural and functional analyses of benzamidine-based inhibitors in complex with trypsin: implications for the inhibition of factor Xa, tPA, and urokinase. J Med Chem 41:5445-56 (1999)  
Target
Name:
Coagulation factor X
Synonyms:
Coagulation factor X FA10_BOVIN | Factor Xa (fXa)
Type:
PROTEIN
Mol. Mass.:
54498.45
Organism:
Bos taurus
Description:
ChEMBL_1364435
Residue:
492
  
Inhibitor
Name:
BDBM50072859
Synonyms:
3-[3-(4-Methyl-piperidin-1-yl)-3-oxo-2-(2,4,6-trimethyl-benzenesulfonylamino)-propyl]-benzamidine | CHEMBL358441
Type:
Small organic molecule
Emp. Form.:
C25H34N4O3S
Mol. Mass.:
470.627
SMILES:
CC1CCN(CC1)C(=O)C(Cc1cccc(c1)C(N)=N)NS(=O)(=O)c1c(C)cc(C)cc1C
: