Target
Epidermal growth factor receptor
Ligand
BDBM50029668
Substrate
Meas. Tech.
ChEMBL_1880803 (CHEMBL4382302)
EC50
18±n/a nM
Citation
 Jang, JSon, JBTo, CBahcall, MKim, SYKang, SYMushajiang, MLee, YJänne, PAChoi, HGGray, NS Discovery of a potent dual ALK and EGFR T790M inhibitor. Eur J Med Chem 136:497-510 (2017)  
Target
Name:
Epidermal growth factor receptor
Synonyms:
EGF Receptor Substrate EGFR_HUMAN ERBB1 Epidermal Growth Factor Receptor erbB-1 Epidermal growth factor receptor (EGFR) HER1 Proto-oncogene c-ErbB-1 Tyrosine-Protein Kinase ErbB-1
Type:
Receptor Kinase Domain
Mol. Mass.:
134279.59
Organism:
Homo sapiens (Human)
Description:
P00533
Residue:
1210
  
Inhibitor
Name:
BDBM50029668
Synonyms:
AZD-9291 US10085983, Compound AZD-9291 US11111233, Example AZD9291 US20230322822, Compound AZD9291 WO2022090481, Example osimertinib
Type:
Small organic molecule
Emp. Form.:
C28H33N7O2
Mol. Mass.:
499.6073
SMILES:
COc1cc(N(C)CCN(C)C)c(NC(=O)C=C)cc1Nc1nccc(n1)-c1cn(C)c2ccccc12
: