Target
Prothrombin
Ligand
BDBM50075940
Substrate
Meas. Tech.
ChEBML_209092
Ki
7.2±n/a nM
Citation
 Zhang, MBailey, DLBastian, JABriggs, SLChirgadze, NYClawson, DKDenney, MLGifford-Moore, DSHarper, RWJohnson, LMKlimkowski, VJKohn, TJLin, HSMcCowan, JRRichett, MESall, DJSmith, AJSmith, GFSnyder, DWTakeuchi, KUtterback, BGYan, SC Dibasic benzo[b]thiophene derivatives as a novel class of active site directed thrombin inhibitors: 2. Sidechain optimization and demonstration of in vivo efficacy. Bioorg Med Chem Lett 9:775-80 (1999)  
Target
Name:
Prothrombin
Synonyms:
Activation peptide fragment 1 Coagulation factor II Prothrombin precursor Thrombin heavy chain | Thrombin light chain
Type:
Protein
Mol. Mass.:
70029.57
Organism:
Homo sapiens (Human)
Description:
P00734
Residue:
622
  
Inhibitor
Name:
BDBM50075940
Synonyms:
5-{6-Hydroxy-2-[4-(2-pyrrolidin-1-yl-ethoxy)-phenyl]-benzo[b]thiophen-3-ylmethyl}-2-pyrrolidin-1-ylmethyl-benzonitrile | CHEMBL418004
Type:
Small organic molecule
Emp. Form.:
C33H35N3O2S
Mol. Mass.:
537.715
SMILES:
Oc1ccc2c(Cc3ccc(CN4CCCC4)c(c3)C#N)c(sc2c1)-c1ccc(OCCN2CCCC2)cc1
: