Target
Beta-galactosidase
Ligand
BDBM50075942
Substrate
Meas. Tech.
ChEMBL_215886 (CHEMBL820818)
Ki
7500±n/a nM
Citation
 Pasquarello, CDemange, RVogel, P Synthesis of alpha-C(1-->3)-mannopyranoside of N-acetylgalactosamine, a new beta-galactosidase inhibitor. Bioorg Med Chem Lett 9:793-6 (1999)  
Target
Name:
Beta-galactosidase
Synonyms:
Acid beta-galactosidase ELNR1 GLB1 | Lactase
Type:
PROTEIN
Mol. Mass.:
76074.43
Organism:
Homo sapiens (Human)
Description:
ChEMBL_215886
Residue:
677
  
Inhibitor
Name:
BDBM50075942
Synonyms:
CHEMBL165192 | N-[2,5-Dihydroxy-6-hydroxymethyl-4-(3,4,5-trihydroxy-6-hydroxymethyl-tetrahydro-pyran-2-ylmethyl)-tetrahydro-pyran-3-yl]-acetamide and N-[5-(1,2-Dihydroxy-ethyl)-2-hydroxy-4-(3,4,5-trihydroxy-6-hydroxymethyl-tetrahydro-pyran-2-ylmethyl)-tetrahydro-furan-3-yl]-acetamide
Type:
Small organic molecule
Emp. Form.:
C15H27NO10
Mol. Mass.:
381.3756
SMILES:
CC(=O)N[C@H]1C(O)O[C@H](C(O)CO)[C@@H]1C[C@H]1O[C@H](CO)[C@@H](O)[C@H](O)[C@@H]1O
: