Target
Protein phosphatase 3 catalytic subunit alpha
Ligand
BDBM50079779
Substrate
Meas. Tech.
ChEBML_42586
IC50
7.3±n/a nM
Citation
 Armstrong, HMWong, FHolmes, MASinclair, PJGoulet, MTDumont, FJStaruch, MJKoprak, SPeterson, LBRosa, RWilusz, MBWiederrecht, GJCryan, JGWyvratt, MJParsons, WH Potent immunosuppressive C32-O-arylethyl ether derivatives of ascomycin with reduced toxicity. Bioorg Med Chem Lett 9:2089-94 (1999)  
Target
Name:
Protein phosphatase 3 catalytic subunit alpha
Synonyms:
CALNA PP2BA_HUMAN Serine/threonine protein phosphatase 2B catalytic subunit, alpha isoform calcineurin
Type:
Enzyme Catalytic Domain
Mol. Mass.:
58681.14
Organism:
Homo sapiens (Human)
Description:
calcineurin 0 HUMAN::Q08209
Residue:
521
  
Inhibitor
Name:
BDBM50079779
Synonyms:
17-Ethyl-1,14-dihydroxy-12-{2-[4-(2-hydroxy-2-naphthalen-2-yl-ethoxy)-3-methoxy-cyclohexyl]-1-methyl-vinyl}-23,25-dimethoxy-13,19,21,27-tetramethyl-11,28-dioxa-4-aza-tricyclo[22.3.1.0*4,9*]octacos-18-ene-2,3,10,16-tetraone | CHEMBL264568
Type:
Small organic molecule
Emp. Form.:
C55H79NO13
Mol. Mass.:
962.2147
SMILES:
CC[C@@H]1\C=C(C)\C[C@H](C)C[C@H](OC)[C@H]2O[C@](O)([C@H](C)C[C@@H]2OC)C(=O)C(=O)N2CCCC[C@H]2C(=O)O[C@@H]([C@H](C)[C@H](O)CC1=O)C(\C)=C\C1CC[C@@H](OC[C@H](O)c2ccc3ccccc3c2)[C@@H](C1)OC
: