Target
Integrase
Ligand
BDBM50527153
Substrate
Meas. Tech.
ChEMBL_1902393 (CHEMBL4404615)
Ki
2000±n/a nM
Citation
 Li, GMeanwell, NAKrystal, MRLangley, DRNaidu, BNSivaprakasam, PLewis, HKish, KKhan, JANg, ATrainor, GLCianci, CDicker, IBWalker, MALin, ZProtack, TDiscotto, LJenkins, SGerritz, SWPendri, A Discovery and Optimization of Novel Pyrazolopyrimidines as Potent and Orally Bioavailable Allosteric HIV-1 Integrase Inhibitors. J Med Chem 63:2620-2637 (2020)  
Target
Name:
Integrase
Synonyms:
pol
Type:
PROTEIN
Mol. Mass.:
32203.43
Organism:
Human immunodeficiency virus 1
Description:
ChEMBL_106649
Residue:
288
  
Inhibitor
Name:
BDBM50527153
Synonyms:
CHEMBL4469948
Type:
Small organic molecule
Emp. Form.:
C20H23N3O3
Mol. Mass.:
353.4149
SMILES:
Cc1ccc(cc1)-c1c(C(OC(C)(C)C)C(O)=O)c(C)nc2ccnn12
: