Target
Integrase
Ligand
BDBM50527159
Substrate
Meas. Tech.
ChEMBL_1902393 (CHEMBL4404615)
Ki
67000±n/a nM
Citation
 Li, GMeanwell, NAKrystal, MRLangley, DRNaidu, BNSivaprakasam, PLewis, HKish, KKhan, JANg, ATrainor, GLCianci, CDicker, IBWalker, MALin, ZProtack, TDiscotto, LJenkins, SGerritz, SWPendri, A Discovery and Optimization of Novel Pyrazolopyrimidines as Potent and Orally Bioavailable Allosteric HIV-1 Integrase Inhibitors. J Med Chem 63:2620-2637 (2020)  
Target
Name:
Integrase
Synonyms:
pol
Type:
PROTEIN
Mol. Mass.:
32203.43
Organism:
Human immunodeficiency virus 1
Description:
ChEMBL_106649
Residue:
288
  
Inhibitor
Name:
BDBM50527159
Synonyms:
CHEMBL4560817
Type:
Small organic molecule
Emp. Form.:
C18H20O3
Mol. Mass.:
284.3496
SMILES:
CC(C)(C)OC(C(O)=O)c1ccccc1-c1ccccc1
: