Target
Non-receptor tyrosine-protein kinase TYK2
Ligand
BDBM50530399
Substrate
Meas. Tech.
ChEMBL_1912210 (CHEMBL4414793)
IC50
2400±n/a nM
Target
Name:
Non-receptor tyrosine-protein kinase TYK2
Synonyms:
Non-receptor tyrosine-protein kinase TYK2 (TYK2) TYK2_HUMAN | Tyrosine-protein kinase TYK2
Type:
Protein
Mol. Mass.:
133666.03
Organism:
Homo sapiens (Human)
Description:
P29597
Residue:
1187
  
Inhibitor
Name:
BDBM50530399
Synonyms:
CHEMBL4476830
Type:
Small organic molecule
Emp. Form.:
C19H16F3N5O2
Mol. Mass.:
403.3578
SMILES:
CNC(=O)c1cnc(Nc2ccc(F)cn2)cc1Nc1ccc(F)c(F)c1OC
: