Target
Platelet-activating factor acetylhydrolase
Ligand
BDBM50085649
Substrate
Meas. Tech.
ChEBML_156217
IC50
1100±n/a nM
Citation
 Boyd, HFFlynn, STHickey, DMIfe, RJJones, MLeach, CAMacphee, CHMilliner, KJRawlings, DASlingsby, BPSmith, SAStansfield, IGTew, DGTheobald, CJ 2-(Alkylthio)pyrimidin-4-ones as novel, reversible inhibitors of lipoprotein-associated phospholipase A2. Bioorg Med Chem Lett 10:395-8 (2000)  
Target
Name:
Platelet-activating factor acetylhydrolase
Synonyms:
1-alkyl-2-acetylglycerophosphocholine esterase LDL-PLA(2) PAF 2-acylhydrolase PAFAH PLA2G7 | Platelet-activating factor acetylhydrolase
Type:
PROTEIN
Mol. Mass.:
50084.41
Organism:
Homo sapiens (Human)
Description:
ChEMBL_156212
Residue:
441
  
Inhibitor
Name:
BDBM50085649
Synonyms:
2-Benzylsulfanyl-5-pyrimidin-5-ylmethyl-1H-pyrimidin-4-one | CHEMBL83141
Type:
Small organic molecule
Emp. Form.:
C16H14N4OS
Mol. Mass.:
310.374
SMILES:
O=c1[nH]c(SCc2ccccc2)ncc1Cc1cncnc1
: