Target
5-hydroxytryptamine receptor 1A
Ligand
BDBM50531264
Substrate
Meas. Tech.
ChEMBL_1914749 (CHEMBL4417332)
EC50
1600±n/a nM
Citation
 Liang, JHLuan, ZLTian, XGZhao, WYWang, YLSun, CPHuo, XKDeng, SZhang, BJZhang, ZJMa, XC Uncarialins A-I, Monoterpenoid Indole Alkaloids from  J Nat Prod 82:3302-3310 (2019)  
Target
Name:
5-hydroxytryptamine receptor 1A
Synonyms:
5-HT-1A 5-hydroxytryptamine receptor 1A (5-HT-1A) ADRB2RL1 Dopamine D2 receptor and serotonin 1a receptor HTR1A | Serotonin receptor 1A
Type:
Mol. Mass.:
46122.49
Organism:
Homo sapiens (Human)
Description:
Residue:
422
  
Inhibitor
Name:
BDBM50531264
Synonyms:
CHEMBL4456720
Type:
Small organic molecule
Emp. Form.:
C27H34N2O10
Mol. Mass.:
546.5663
SMILES:
[H][C@@]1(O[C@@H]2OC=C(C(=O)OC)[C@@]3([H])C[C@]4([H])N(CCc5c4[nH]c4ccccc54)C[C@H](O)[C@@]23[H])O[C@H](CO)[C@@H](O)[C@H](O)[C@H]1O
: