Target
5-hydroxytryptamine receptor 1A
Ligand
BDBM50531275
Substrate
Meas. Tech.
ChEMBL_1914749 (CHEMBL4417332)
EC50
11400±n/a nM
Citation
 Liang, JHLuan, ZLTian, XGZhao, WYWang, YLSun, CPHuo, XKDeng, SZhang, BJZhang, ZJMa, XC Uncarialins A-I, Monoterpenoid Indole Alkaloids from  J Nat Prod 82:3302-3310 (2019)  
Target
Name:
5-hydroxytryptamine receptor 1A
Synonyms:
5-HT-1A 5-hydroxytryptamine receptor 1A (5-HT-1A) ADRB2RL1 Dopamine D2 receptor and serotonin 1a receptor HTR1A | Serotonin receptor 1A
Type:
Mol. Mass.:
46122.49
Organism:
Homo sapiens (Human)
Description:
Residue:
422
  
Inhibitor
Name:
BDBM50531275
Synonyms:
CHEMBL4580078
Type:
Small organic molecule
Emp. Form.:
C21H26N2O4
Mol. Mass.:
370.4421
SMILES:
[H][C@@]1(C[C@@]2([H])c3[nH]c4ccccc4c3CC[N@+]2([O-])C\C1=C/C)[C@H](CO)C(=O)OC
: