Target
5-hydroxytryptamine receptor 1A
Ligand
BDBM50531276
Substrate
Meas. Tech.
ChEMBL_1914749 (CHEMBL4417332)
EC50
>100000±n/a nM
Citation
 Liang, JHLuan, ZLTian, XGZhao, WYWang, YLSun, CPHuo, XKDeng, SZhang, BJZhang, ZJMa, XC Uncarialins A-I, Monoterpenoid Indole Alkaloids from  J Nat Prod 82:3302-3310 (2019)  
Target
Name:
5-hydroxytryptamine receptor 1A
Synonyms:
5-HT-1A 5-hydroxytryptamine receptor 1A (5-HT-1A) ADRB2RL1 Dopamine D2 receptor and serotonin 1a receptor HTR1A | Serotonin receptor 1A
Type:
Mol. Mass.:
46122.49
Organism:
Homo sapiens (Human)
Description:
Residue:
422
  
Inhibitor
Name:
BDBM50531276
Synonyms:
CHEMBL4567737
Type:
Small organic molecule
Emp. Form.:
C22H26N2O4
Mol. Mass.:
382.4528
SMILES:
[H][C@@]12C[C@H](\C(=C/OC)C(=O)OC)\C(C[N+]1([O-])CCc1c2[nH]c2ccccc12)=C/C
: