Target
Monoglyceride lipase
Ligand
BDBM50531974
Substrate
Meas. Tech.
ChEMBL_1921754 (CHEMBL4424599)
IC50
74±n/a nM
Citation
 Granchi, CLapillo, MGlasmacher, SBononi, GLicari, CPoli, GEl Boustani, MCaligiuri, IRizzolio, FGertsch, JMacchia, MMinutolo, FTuccinardi, TChicca, A Optimization of a Benzoylpiperidine Class Identifies a Highly Potent and Selective Reversible Monoacylglycerol Lipase (MAGL) Inhibitor. J Med Chem 62:1932-1958 (2019)  
Target
Name:
Monoglyceride lipase
Synonyms:
HU-K5 Lysophospholipase-like MGL MGLL_HUMAN
Type:
Hydrolase
Mol. Mass.:
33264.56
Organism:
Homo sapiens (Human)
Description:
Human recombinant MGL (Cayman Chemical, cat# 10008354).
Residue:
303
  
Inhibitor
Name:
BDBM50531974
Synonyms:
CHEMBL4575018
Type:
Small organic molecule
Emp. Form.:
C23H26FNO3
Mol. Mass.:
383.4558
SMILES:
CCCCc1ccc(cc1)C(=O)C1CCN(CC1)C(=O)c1cc(O)ccc1F
: