Target
Monoglyceride lipase
Ligand
BDBM60622
Substrate
Meas. Tech.
ChEMBL_1921754 (CHEMBL4424599)
IC50
49±n/a nM
Citation
 Granchi, CLapillo, MGlasmacher, SBononi, GLicari, CPoli, GEl Boustani, MCaligiuri, IRizzolio, FGertsch, JMacchia, MMinutolo, FTuccinardi, TChicca, A Optimization of a Benzoylpiperidine Class Identifies a Highly Potent and Selective Reversible Monoacylglycerol Lipase (MAGL) Inhibitor. J Med Chem 62:1932-1958 (2019)  
Target
Name:
Monoglyceride lipase
Synonyms:
HU-K5 Lysophospholipase-like MGL MGLL_HUMAN
Type:
Hydrolase
Mol. Mass.:
33264.56
Organism:
Homo sapiens (Human)
Description:
Human recombinant MGL (Cayman Chemical, cat# 10008354).
Residue:
303
  
Inhibitor
Name:
BDBM60622
Synonyms:
BDBM50300355 US9133148, A
Type:
Emp. Form.:
C27H24N2O9
Mol. Mass.:
520.4875
SMILES:
OC(C1CCN(CC1)C(=O)Oc1ccc(cc1)[N+]([O-])=O)(c1ccc2OCOc2c1)c1ccc2OCOc2c1
: