Target
5-hydroxytryptamine receptor 1B
Ligand
BDBM50088870
Substrate
Meas. Tech.
ChEBML_1361
Ki
17±n/a nM
Citation
 Meng, CQRakhit, SLee, DKKamboj, RMcCallum, KLMazzocco, LDyne, KSlassi, A 5-Thienyltryptamine derivatives as serotonin 5-HT1B/1D receptor agonists: potential treatments for migraine. Bioorg Med Chem Lett 10:903-5 (2000)  
Target
Name:
5-hydroxytryptamine receptor 1B
Synonyms:
5-HT-1B 5-HT1B 5HT1B_HUMAN HTR1DB Serotonin (5-HT) receptor Serotonin Receptor 1B
Type:
G Protein-Coupled Receptor (GPCR)
Mol. Mass.:
43579.17
Organism:
Homo sapiens (Human)
Description:
Receptor binding assays were performed using human clone stably expressed in CHO cells
Residue:
390
  
Inhibitor
Name:
BDBM50088870
Synonyms:
CHEMBL171129 | Dimethyl-[2-(5-thiophen-3-yl-1H-indol-3-yl)-ethyl]-amine
Type:
Small organic molecule
Emp. Form.:
C16H18N2S
Mol. Mass.:
270.393
SMILES:
CN(C)CCc1c[nH]c2ccc(cc12)-c1ccsc1
: