Target
Cathepsin B
Ligand
BDBM50090643
Substrate
Meas. Tech.
ChEBML_47257
Ki
1250±n/a nM
Citation
 Lynas, JFHawthorne, SJWalker, B Development of peptidyl alpha-keto-beta-aldehydes as new inhibitors of cathepsin L--comparisons of potency and selectivity profiles with cathepsin B. Bioorg Med Chem Lett 10:1771-3 (2000)  
Target
Name:
Cathepsin B
Synonyms:
BCSB CTSB Cathepsin B1
Type:
Enzyme
Mol. Mass.:
36657.87
Organism:
Bos taurus (bovine)
Description:
Bovine spleen CB was purchased from Sigma Co. (USA).
Residue:
335
  
Inhibitor
Name:
BDBM50090643
Synonyms:
(S)-2-Acetylamino-4-methyl-pentanoic acid {(S)-1-[(S)-4-guanidino-1-(2-oxo-acetyl)-butylcarbamoyl]-3-methyl-butyl}-amide | CHEMBL48605
Type:
Small organic molecule
Emp. Form.:
C21H38N6O5
Mol. Mass.:
454.5636
SMILES:
CC(C)C[C@H](NC(C)=O)C(=O)N[C@@H](CC(C)C)C(=O)N[C@@H](CCCNC(N)=N)C(=O)C=O
: