Target
Misshapen-like kinase 1
Ligand
BDBM50535489
Substrate
Meas. Tech.
ChEMBL_1930839 (CHEMBL4434090)
IC50
13±n/a nM
Citation
 Read, JCollie, ITNguyen-McCarty, MLucaj, CRobinson, JConway, LMukherjee, JMcCall, EDonohoe, GFlavell, EPeciak, KWarwicker, JDix, CVan den Hoven, BGMadin, ABrown, DGMoss, SHaggarty, SJBrandon, NJBürli, RW Tool inhibitors and assays to interrogate the biology of the TRAF2 and NCK interacting kinase. Bioorg Med Chem Lett 29:1962-1967 (2019)  
Target
Name:
Misshapen-like kinase 1
Synonyms:
B55 MAP4K6 MEK kinase kinase 6 MINK MINK1_HUMAN Misshapen/NIK-related kinase Voltage-gated potassium channel subunit Kv7.1/Misshapen-like kinase 1 ZC3
Type:
PROTEIN
Mol. Mass.:
149838.92
Organism:
Homo sapiens (Human)
Description:
ChEMBL_793919
Residue:
1332
  
Inhibitor
Name:
BDBM50535489
Synonyms:
CHEMBL4471729
Type:
Small organic molecule
Emp. Form.:
C13H8BrFN4
Mol. Mass.:
319.132
SMILES:
Nc1ncc(Br)c2ccc(nc12)-c1ccnc(F)c1
: