Target
Integrin alpha-L/Integrin beta-2/Intercellular adhesion molecule 1
Ligand
BDBM50092920
Substrate
Meas. Tech.
ChEMBL_97281 (CHEMBL711777)
IC50
>20000±n/a nM
Citation
 Liu, GLink, JTPei, ZReilly, EBLeitza, SNguyen, BMarsh, KCOkasinski, GFvon Geldern, TWOrmes, MFowler, KGallatin, M Discovery of novel p-arylthio cinnamides as antagonists of leukocyte function-associated antigen-1/intracellular adhesion molecule-1 interaction. 1. Identification of an additional binding pocket based on an anilino diaryl sulfide lead. J Med Chem 43:4025-40 (2000)  
Target
Name:
Integrin alpha-L/Integrin beta-2/Intercellular adhesion molecule 1
Synonyms:
Integrin beta-2/Intercellular adhesion molecule-1 /Leukocyte adhesion glycoprotein LFA-1 alpha | Intercellular adhesion molecule (ICAM-1), Integrin alpha-L/beta-2
Type:
Mol. Mass.:
Description:
ASSAY_ID of EBI is 97281
Components:
This complex has 3 components.
Component 1
Name:
Integrin alpha-L
Synonyms:
CD11 antigen-like family member A CD_antigen=CD11a ITGAL LFA-1A Leukocyte adhesion glycoprotein LFA-1 alpha chain | Leukocyte function-associated molecule 1 alpha chain
Type:
PROTEIN
Mol. Mass.:
128748.90
Organism:
Homo sapiens (Human)
Description:
ChEMBL_629045
Residue:
1170
  
Component 2
Name:
Intercellular adhesion molecule 1
Synonyms:
CD_antigen=CD54 ICAM1 Intercellular adhesion molecule (ICAM-1), Integrin alpha-L/beta-2 Intercellular adhesion molecule-1 | Major group rhinovirus receptor
Type:
PROTEIN
Mol. Mass.:
57831.10
Organism:
Homo sapiens (Human)
Description:
ChEMBL_826675
Residue:
532
  
Component 3
Name:
Integrin beta-2
Synonyms:
CD18 ITGB2 MFI7
Type:
PROTEIN
Mol. Mass.:
84785.60
Organism:
Homo sapiens (Human)
Description:
EBI_12662
Residue:
769
  
Inhibitor
Name:
BDBM50092920
Synonyms:
3-[4-(2,4-Dichloro-phenylsulfanyl)-3-(3-morpholin-4-yl-3-oxo-propenyl)-phenyl]-N-[3-(2-oxo-pyrrolidin-1-yl)-propyl]-acrylamide | CHEMBL130446
Type:
Small organic molecule
Emp. Form.:
C29H31Cl2N3O4S
Mol. Mass.:
588.545
SMILES:
Clc1ccc(Sc2ccc(\C=C\C(=O)NCCCN3CCCC3=O)cc2\C=C\C(=O)N2CCOCC2)c(Cl)c1
: