Target
Histone acetyltransferase p300
Ligand
BDBM50542060
Substrate
Meas. Tech.
ChEMBL_1985843 (CHEMBL4619249)
IC50
<0.500000±n/a nM
Citation
 Wilson, JEPatel, GPatel, CBrucelle, FHuhn, AGardberg, ASPoy, FCantone, NBommi-Reddy, ASims, RJCummings, RTLevell, JR Discovery of CPI-1612: A Potent, Selective, and Orally Bioavailable EP300/CBP Histone Acetyltransferase Inhibitor. ACS Med Chem Lett 11:1324-1329 (2020)  
Target
Name:
Histone acetyltransferase p300
Synonyms:
EP300 HIF1A/p300/CREB-binding protein P300
Type:
Protein
Mol. Mass.:
264223.04
Organism:
Homo sapiens (Human)
Description:
Q09472
Residue:
2414
  
Inhibitor
Name:
BDBM50542060
Synonyms:
CHEMBL4641354 | US11274090, Example 33 Isomer 2
Type:
Small organic molecule
Emp. Form.:
C27H26N6O
Mol. Mass.:
450.5349
SMILES:
C[C@H](CN[C@@H](C(=O)Nc1ccc(cn1)-c1cnn(C)c1)c1ccccc1)c1ccc(cc1)C#N
: