Target
Coagulation factor XI
Ligand
BDBM50542740
Substrate
Meas. Tech.
ChEMBL_1987832 (CHEMBL4621379)
IC50
2.0±n/a nM
Citation
 Lorthiois, ERoache, JBarnes-Seeman, DAltmann, EHassiepen, UTurner, GDuvadie, RHornak, VKarki, RGSchiering, NWeihofen, WAPerruccio, FCalhoun, AFazal, TDedic, DDurand, CDussauge, SFettis, KTritsch, FDentel, CDruet, ALiu, DKirman, LLachal, JNamoto, KBevan, DMo, RMonnet, GMuller, LZessis, RHuang, XLindsley, LCurrie, TChiu, YHFridrich, CDelgado, PWang, SHollis-Symynkywicz, MBerghausen, JWilliams, ELiu, HLiang, GKim, HHoffmann, PHein, ARamage, PD'Arcy, AHarlfinger, SRenatus, MRuedisser, SFeldman, DElliott, JSedrani, RMaibaum, JAdams, CM Structure-Based Design and Preclinical Characterization of Selective and Orally Bioavailable Factor XIa Inhibitors: Demonstrating the Power of an Integrated S1 Protease Family Approach. J Med Chem 63:8088-8113 (2020)  
Target
Name:
Coagulation factor XI
Synonyms:
Coagulation factor XIa Coagulation factor XIa light chain FA11_HUMAN Factor XIa PTA | Plasma thromboplastin antecedent
Type:
Enzyme
Mol. Mass.:
70130.58
Organism:
Homo sapiens (Human)
Description:
P03951
Residue:
625
  
Inhibitor
Name:
BDBM50542740
Synonyms:
CHEMBL4646398
Type:
Small organic molecule
Emp. Form.:
C28H30N2O4
Mol. Mass.:
458.5488
SMILES:
CC(C)c1cc(cc(c1)-c1ccc2OC[C@@H](N)c2c1)C(O)CN1CCc2cccc(C(O)=O)c12
: