Target
Carnitine O-palmitoyltransferase 1, muscle isoform
Ligand
BDBM50101594
Substrate
Meas. Tech.
ChEMBL_46323 (CHEMBL660891)
IC50
2300±n/a nM
Citation
 Giannessi, FChiodi, PMarzi, MMinetti, PPessotto, PDe Angelis, FTassoni, EConti, RGiorgi, FMabilia, MDell'Uomo, NMuck, STinti, MOCarminati, PArduini, A Reversible carnitine palmitoyltransferase inhibitors with broad chemical diversity as potential antidiabetic agents. J Med Chem 44:2383-6 (2001)  
Target
Name:
Carnitine O-palmitoyltransferase 1, muscle isoform
Synonyms:
CPT1B_RAT Cpt1b
Type:
PROTEIN
Mol. Mass.:
88241.28
Organism:
Rattus norvegicus
Description:
ChEMBL_887447
Residue:
772
  
Inhibitor
Name:
BDBM50101594
Synonyms:
CHEMBL80493 | [3-Carboxy-2-(decane-1-sulfonylamino)-propyl]-trimethyl-ammonium
Type:
Small organic molecule
Emp. Form.:
C17H36N2O4S
Mol. Mass.:
364.544
SMILES:
CCCCCCCCCCS(=O)(=O)NC(CC([O-])=O)C[N+](C)(C)C
: