Target
D(3) dopamine receptor
Ligand
BDBM50103142
Substrate
Meas. Tech.
ChEMBL_62927 (CHEMBL858399)
Ki
2512±n/a nM
Citation
 Witherington, JBordas, VCooper, DGForbes, ITGribble, ADIfe, RJBerkhout, TGohil, JGroot, PH Conformationally restricted indolopiperidine derivatives as potent CCR2B receptor antagonists. Bioorg Med Chem Lett 11:2177-80 (2001)  
Target
Name:
D(3) dopamine receptor
Synonyms:
DOPAMINE D3 DRD3_HUMAN Dopamine D3 receptor (D3) Dopamine receptor Dopamine receptor D3
Type:
Mol. Mass.:
44243.43
Organism:
Homo sapiens (Human)
Description:
Residue:
400
  
Inhibitor
Name:
BDBM50103142
Synonyms:
(E)-3-(3,4-Dichloro-phenyl)-N-{4-[(R)-3-((2S,7aS)-5-hydroxy-1H-indol-3-yl)-8-aza-bicyclo[3.2.1]oct-8-ylmethyl]-cyclohexyl}-acrylamide | CHEMBL71707
Type:
Small organic molecule
Emp. Form.:
C31H35Cl2N3O2
Mol. Mass.:
552.535
SMILES:
Oc1ccc2[nH]cc([C@H]3C[C@@H]4CC[C@H](C3)N4C[C@H]3CC[C@H](CC3)NC(=O)\C=C\c3ccc(Cl)c(Cl)c3)c2c1
: