Target
C-C chemokine receptor type 2
Ligand
BDBM50091438
Substrate
Meas. Tech.
ChEMBL_41913 (CHEMBL655704)
Ki
50±n/a nM
Citation
 Witherington, JBordas, VCooper, DGForbes, ITGribble, ADIfe, RJBerkhout, TGohil, JGroot, PH Conformationally restricted indolopiperidine derivatives as potent CCR2B receptor antagonists. Bioorg Med Chem Lett 11:2177-80 (2001)  
Target
Name:
C-C chemokine receptor type 2
Synonyms:
C-C chemokine receptor type 2 (CCR2) CCR2_HUMAN Chemoattractant Cytokine Receptor 2 (CCR2) Monocyte chemotactic protein-1 (MCP-1)
Type:
Enzyme
Mol. Mass.:
41932.32
Organism:
Homo sapiens (Human)
Description:
P41597
Residue:
374
  
Inhibitor
Name:
BDBM50091438
Synonyms:
(E)-3-(3,4-Dichloro-phenyl)-N-{5-[4-(5-hydroxy-1H-indol-3-yl)-piperidin-1-yl]-pentyl}-acrylamide 3-(3,4-dichlorophenyl)-N-(5-(4-(5-hydroxy-1H-indol-3-yl)piperidin-1-yl)pentyl)acrylamide TCMDC-139245
Type:
Small organic molecule
Emp. Form.:
C27H31Cl2N3O2
Mol. Mass.:
500.46
SMILES:
Oc1ccc2[nH]cc(C3CCN(CCCCCNC(=O)\C=C\c4ccc(Cl)c(Cl)c4)CC3)c2c1
: