Target
Integrin alpha-L/Integrin beta-2/Intercellular adhesion molecule 1
Ligand
BDBM50103294
Substrate
Meas. Tech.
ChEMBL_178776 (CHEMBL783622)
IC50
60±n/a nM
Citation
 Pei, ZXin, ZLiu, GLi, YReilly, EBLubbers, NLHuth, JRLink, JTvon Geldern, TWCox, BFLeitza, SGao, YMarsh, KCDeVries, POkasinski, GF Discovery of potent antagonists of leukocyte function-associated antigen-1/intercellular adhesion molecule-1 interaction. 3. Amide (C-ring) structure-activity relationship and improvement of overall properties of arylthio cinnamides. J Med Chem 44:2913-20 (2001)  
Target
Name:
Integrin alpha-L/Integrin beta-2/Intercellular adhesion molecule 1
Synonyms:
Integrin beta-2/Intercellular adhesion molecule-1 /Leukocyte adhesion glycoprotein LFA-1 alpha | Intercellular adhesion molecule (ICAM-1), Integrin alpha-L/beta-2
Type:
Mol. Mass.:
Description:
ASSAY_ID of EBI is 97281
Components:
This complex has 3 components.
Component 1
Name:
Integrin alpha-L
Synonyms:
CD11 antigen-like family member A CD_antigen=CD11a ITGAL LFA-1A Leukocyte adhesion glycoprotein LFA-1 alpha chain | Leukocyte function-associated molecule 1 alpha chain
Type:
PROTEIN
Mol. Mass.:
128748.90
Organism:
Homo sapiens (Human)
Description:
ChEMBL_629045
Residue:
1170
  
Component 2
Name:
Intercellular adhesion molecule 1
Synonyms:
CD_antigen=CD54 ICAM1 Intercellular adhesion molecule (ICAM-1), Integrin alpha-L/beta-2 Intercellular adhesion molecule-1 | Major group rhinovirus receptor
Type:
PROTEIN
Mol. Mass.:
57831.10
Organism:
Homo sapiens (Human)
Description:
ChEMBL_826675
Residue:
532
  
Component 3
Name:
Integrin beta-2
Synonyms:
CD18 ITGB2 MFI7
Type:
PROTEIN
Mol. Mass.:
84785.60
Organism:
Homo sapiens (Human)
Description:
EBI_12662
Residue:
769
  
Inhibitor
Name:
BDBM50103294
Synonyms:
4-{3-[4-(2-Isopropyl-phenylsulfanyl)-3-nitro-phenyl]-acryloyl}-piperazine-2-carboxylic acid methyl ester | CHEMBL97875
Type:
Small organic molecule
Emp. Form.:
C24H27N3O5S
Mol. Mass.:
469.553
SMILES:
COC(=O)C1CN(CCN1)C(=O)\C=C\c1ccc(Sc2ccccc2C(C)C)c(c1)[N+]([O-])=O
: