Target
Vascular cell adhesion protein 1
Ligand
BDBM50105200
Substrate
Meas. Tech.
ChEMBL_213809 (CHEMBL818854)
IC50
>1000±n/a nM
Citation
 Zhu, GDArendsen, DLGunawardana, IWBoyd, SAStewart, AOFry, DGCool, BLKifle, LSchaefer, VMeuth, JMarsh, KCKempf-Grote, AJKilgannon, PGallatin, WMOkasinski, GF Selective inhibition of ICAM-1 and E-selectin expression in human endothelial cells. 2. Aryl modifications of 4-(aryloxy)thieno[2,3-c]pyridines with fine-tuning at C-2 carbamides. J Med Chem 44:3469-87 (2001)  
Target
Name:
Vascular cell adhesion protein 1
Synonyms:
CD106 antigen VCAM-1 VCAM1_HUMAN Vascular cell adhesion protein 1 (VCAM-1) | Vascular cell adhesion protein 1 precursor
Type:
Other Protein Type
Mol. Mass.:
81259.16
Organism:
Homo sapiens (Human)
Description:
P19320
Residue:
739
  
Inhibitor
Name:
BDBM50105200
Synonyms:
4-(4-Chloro-3-methyl-phenoxy)-thieno[2,3-c]pyridine-2-carboxylic acid amide | CHEMBL115815
Type:
Small organic molecule
Emp. Form.:
C15H11ClN2O2S
Mol. Mass.:
318.778
SMILES:
Cc1cc(Oc2cncc3sc(cc23)C(N)=O)ccc1Cl
: