Target
Potassium voltage-gated channel subfamily KQT member 1
Ligand
BDBM50106167
Substrate
Meas. Tech.
ChEMBL_158397 (CHEMBL767061)
IC50
18±n/a nM
Citation
 Lloyd, JSchmidt, JBRovnyak, GAhmad, SAtwal, KSBisaha, SNDoweyko, LMStein, PDTraeger, SCMathur, AConder, MLDiMarco, JHarper, TWJenkins-West, TLevesque, PCNormandin, DERussell, ADSerafino, RPSmith, MALodge, NJ Design and synthesis of 4-substituted benzamides as potent, selective, and orally bioavailable I(Ks) blockers. J Med Chem 44:3764-7 (2001)  
Target
Name:
Potassium voltage-gated channel subfamily KQT member 1
Synonyms:
IKs producing slow voltage-gated potassium channel subunit alpha KvLQT1 KCNQ1_CAVPO KVLQT1 Voltage-gated potassium channel subunit Kv7.1
Type:
PROTEIN
Mol. Mass.:
74450.11
Organism:
Cavia porcellus
Description:
ChEMBL_88894
Residue:
671
  
Inhibitor
Name:
BDBM50106167
Synonyms:
CHEMBL125000 | Enantiomer-4-(3-Cyclopropylmethyl-[1,2,4]oxadiazol-5-yl)-N-(2,2-dimethyl-cyclopentylmethyl)-benzamide
Type:
Small organic molecule
Emp. Form.:
C21H27N3O2
Mol. Mass.:
353.458
SMILES:
CC1(C)CCCC1CNC(=O)c1ccc(cc1)-c1nc(CC2CC2)no1
: