Target
Potassium voltage-gated channel subfamily KQT member 1
Ligand
BDBM50106170
Substrate
Meas. Tech.
ChEMBL_158397 (CHEMBL767061)
IC50
3500±n/a nM
Citation
 Lloyd, JSchmidt, JBRovnyak, GAhmad, SAtwal, KSBisaha, SNDoweyko, LMStein, PDTraeger, SCMathur, AConder, MLDiMarco, JHarper, TWJenkins-West, TLevesque, PCNormandin, DERussell, ADSerafino, RPSmith, MALodge, NJ Design and synthesis of 4-substituted benzamides as potent, selective, and orally bioavailable I(Ks) blockers. J Med Chem 44:3764-7 (2001)  
Target
Name:
Potassium voltage-gated channel subfamily KQT member 1
Synonyms:
IKs producing slow voltage-gated potassium channel subunit alpha KvLQT1 KCNQ1_CAVPO KVLQT1 Voltage-gated potassium channel subunit Kv7.1
Type:
PROTEIN
Mol. Mass.:
74450.11
Organism:
Cavia porcellus
Description:
ChEMBL_88894
Residue:
671
  
Inhibitor
Name:
BDBM50106170
Synonyms:
CHEMBL122865 | N-(2-Diethylamino-ethyl)-4-hexyloxy-benzamide
Type:
Small organic molecule
Emp. Form.:
C19H32N2O2
Mol. Mass.:
320.4696
SMILES:
CCCCCCOc1ccc(cc1)C(=O)NCCN(CC)CC
: