Target
Potassium voltage-gated channel subfamily KQT member 1
Ligand
BDBM50106178
Substrate
Meas. Tech.
ChEMBL_158397 (CHEMBL767061)
IC50
23±n/a nM
Citation
 Lloyd, JSchmidt, JBRovnyak, GAhmad, SAtwal, KSBisaha, SNDoweyko, LMStein, PDTraeger, SCMathur, AConder, MLDiMarco, JHarper, TWJenkins-West, TLevesque, PCNormandin, DERussell, ADSerafino, RPSmith, MALodge, NJ Design and synthesis of 4-substituted benzamides as potent, selective, and orally bioavailable I(Ks) blockers. J Med Chem 44:3764-7 (2001)  
Target
Name:
Potassium voltage-gated channel subfamily KQT member 1
Synonyms:
IKs producing slow voltage-gated potassium channel subunit alpha KvLQT1 KCNQ1_CAVPO KVLQT1 Voltage-gated potassium channel subunit Kv7.1
Type:
PROTEIN
Mol. Mass.:
74450.11
Organism:
Cavia porcellus
Description:
ChEMBL_88894
Residue:
671
  
Inhibitor
Name:
BDBM50106178
Synonyms:
4-(3-Butyl-[1,2,4]oxadiazol-5-yl)-N-(3,3-dimethyl-butyl)-benzamide | CHEMBL124545
Type:
Small organic molecule
Emp. Form.:
C19H27N3O2
Mol. Mass.:
329.4366
SMILES:
CCCCc1noc(n1)-c1ccc(cc1)C(=O)NCCC(C)(C)C
: