Target
Transcriptional enhancer factor TEF-3
Ligand
BDBM50547131
Substrate
Meas. Tech.
ChEMBL_2017235 (CHEMBL4670813)
IC50
3700±n/a nM
Citation
 Karatas, HAkbarzadeh, MAdihou, HHahne, GPobbati, AVYihui Ng, EGuéret, SMSievers, SPahl, AMetz, MZinken, SDötsch, LNowak, CThavam, SFriese, AKang, CHong, WWaldmann, H Discovery of Covalent Inhibitors Targeting the Transcriptional Enhanced Associate Domain Central Pocket. J Med Chem 63:11972-11989 (2020)  
Target
Name:
Transcriptional enhancer factor TEF-3
Synonyms:
RTEF1 TEA domain family member 4 TEAD4 TEF3 Transcription factor RTEF-1 | Transcriptional enhancer factor TEF-3
Type:
PROTEIN
Mol. Mass.:
48333.01
Organism:
Homo sapiens
Description:
ChEMBL_118073
Residue:
434
  
Inhibitor
Name:
BDBM50547131
Synonyms:
CHEMBL4800702
Type:
Small organic molecule
Emp. Form.:
C18H15BrN2O4
Mol. Mass.:
403.227
SMILES:
OCc1cc(=O)c(O)c(o1)C(Nc1ccccn1)c1ccc(Br)cc1
: