Target
Transcriptional enhancer factor TEF-3
Ligand
BDBM50547132
Substrate
Meas. Tech.
ChEMBL_2017237 (CHEMBL4670815)
IC50
1100±n/a nM
Citation
 Karatas, HAkbarzadeh, MAdihou, HHahne, GPobbati, AVYihui Ng, EGuéret, SMSievers, SPahl, AMetz, MZinken, SDötsch, LNowak, CThavam, SFriese, AKang, CHong, WWaldmann, H Discovery of Covalent Inhibitors Targeting the Transcriptional Enhanced Associate Domain Central Pocket. J Med Chem 63:11972-11989 (2020)  
Target
Name:
Transcriptional enhancer factor TEF-3
Synonyms:
RTEF1 TEA domain family member 4 TEAD4 TEF3 Transcription factor RTEF-1 | Transcriptional enhancer factor TEF-3
Type:
PROTEIN
Mol. Mass.:
48333.01
Organism:
Homo sapiens
Description:
ChEMBL_118073
Residue:
434
  
Inhibitor
Name:
BDBM50547132
Synonyms:
CHEMBL4797545
Type:
Small organic molecule
Emp. Form.:
C19H17N3O5
Mol. Mass.:
367.3554
SMILES:
NC(=O)c1ccc(NC(c2ccccn2)c2oc(CO)cc(=O)c2O)cc1
: