Target
Transcriptional enhancer factor TEF-3
Ligand
BDBM50547145
Substrate
Meas. Tech.
ChEMBL_2017237 (CHEMBL4670815)
IC50
400±n/a nM
Citation
 Karatas, HAkbarzadeh, MAdihou, HHahne, GPobbati, AVYihui Ng, EGuéret, SMSievers, SPahl, AMetz, MZinken, SDötsch, LNowak, CThavam, SFriese, AKang, CHong, WWaldmann, H Discovery of Covalent Inhibitors Targeting the Transcriptional Enhanced Associate Domain Central Pocket. J Med Chem 63:11972-11989 (2020)  
Target
Name:
Transcriptional enhancer factor TEF-3
Synonyms:
RTEF1 TEA domain family member 4 TEAD4 TEF3 Transcription factor RTEF-1 | Transcriptional enhancer factor TEF-3
Type:
PROTEIN
Mol. Mass.:
48333.01
Organism:
Homo sapiens
Description:
ChEMBL_118073
Residue:
434
  
Inhibitor
Name:
BDBM50547145
Synonyms:
CHEMBL4750624
Type:
Small organic molecule
Emp. Form.:
C20H19NO4
Mol. Mass.:
337.3692
SMILES:
OCc1cc(=O)c(O)c(o1)C(NCc1ccccc1)c1ccccc1
: