Target
Transcriptional enhancer factor TEF-5
Ligand
BDBM50547124
Substrate
Meas. Tech.
ChEMBL_2017249 (CHEMBL4670827)
IC50
2600±n/a nM
Citation
 Karatas, HAkbarzadeh, MAdihou, HHahne, GPobbati, AVYihui Ng, EGuéret, SMSievers, SPahl, AMetz, MZinken, SDötsch, LNowak, CThavam, SFriese, AKang, CHong, WWaldmann, H Discovery of Covalent Inhibitors Targeting the Transcriptional Enhanced Associate Domain Central Pocket. J Med Chem 63:11972-11989 (2020)  
Target
Name:
Transcriptional enhancer factor TEF-5
Synonyms:
DTEF-1 TEAD-3 TEAD3_HUMAN TEF5 | Transcriptional enhancer factor TEF-5
Type:
PROTEIN
Mol. Mass.:
48683.38
Organism:
Homo sapiens
Description:
ChEMBL_119185
Residue:
435
  
Inhibitor
Name:
BDBM50547124
Synonyms:
CHEMBL242708 | NCI-0001009
Type:
Small organic molecule
Emp. Form.:
C19H17NO4
Mol. Mass.:
323.3426
SMILES:
OCc1cc(=O)c(O)c(o1)C(Nc1ccccc1)c1ccccc1
: