Target
C-C chemokine receptor type 5
Ligand
BDBM50110096
Substrate
Meas. Tech.
ChEBML_39510
IC50
5±n/a nM
Citation
 Lynch, CLGentry, ALHale, JJMills, SGMacCoss, MMalkowitz, LSpringer, MSGould, SLDeMartino, JASiciliano, SJCascieri, MADoss, GCarella, ACarver, GHolmes, KSchleif, WADanzeisen, RHazuda, DKessler, JLineberger, JMiller, MEmini, EA CCR5 antagonists: bicyclic isoxazolidines as conformationally constrained N-1-substituted pyrrolidines. Bioorg Med Chem Lett 12:677-9 (2002)  
Target
Name:
C-C chemokine receptor type 5
Synonyms:
C-C CKR-5 CC-CKR-5 CCR5 CCR5_HUMAN CHEMR13 HIV-1 fusion coreceptor
Type:
Enzyme
Mol. Mass.:
40540.21
Organism:
Homo sapiens (Human)
Description:
P51681
Residue:
352
  
Inhibitor
Name:
BDBM50110096
Synonyms:
1-benzyloxycarbonyl(ethyl)1-[4'-phenyl-(3a'S,4'S,5'S)-spiro[cyclohexane-1,2'-perhydropyrrolo[1,2-b]isoxazole]-5-ylmethyl]hexahydro-4-pyridinylamine | CHEMBL423427
Type:
Small organic molecule
Emp. Form.:
C33H45N3O3
Mol. Mass.:
531.7287
SMILES:
CCN(C1CCN(C[C@H]2CN3OC4(C[C@H]3[C@@H]2c2ccccc2)CCCCC4)CC1)C(=O)OCc1ccccc1
: