Target
Tumor necrosis factor
Ligand
BDBM50552364
Substrate
Meas. Tech.
ChEMBL_2034104 (CHEMBL4688262)
IC50
14±n/a nM
Citation
 Xiao, HYLi, NDuan, JJJiang, BLu, ZNgu, KTino, JKopcho, LMLu, HChen, JTebben, AJSheriff, SChang, CYYanchunas, JCalambur, DGao, MShuster, DJSusulic, VXie, JHGuarino, VRWu, DRGregor, KRGoldstine, CBHynes, JMacor, JESalter-Cid, LBurke, JRShaw, PJDhar, TGM Biologic-like In Vivo Efficacy with Small Molecule Inhibitors of TNF? Identified Using Scaffold Hopping and Structure-Based Drug Design Approaches. J Med Chem 63:15050-15071 (2020)  
Target
Name:
Tumor necrosis factor
Synonyms:
Cachectin TNF-a TNFA TNFSF2 Tumor necrosis factor (TNFa) Tumor necrosis factor ligand superfamily member 2 Tumor necrosis factor, soluble form | tumor necrosis factor alpha
Type:
Enzyme
Mol. Mass.:
25645.11
Organism:
Homo sapiens (Human)
Description:
P01375
Residue:
233
  
Inhibitor
Name:
BDBM50552364
Synonyms:
CHEMBL4781606
Type:
Small organic molecule
Emp. Form.:
C24H23ClN4O
Mol. Mass.:
418.919
SMILES:
C[C@@H](Nc1c(Cl)cnc2ccc(cc12)-c1cnc(nc1)C(C)(C)O)c1ccccc1
: