Target
Corticotropin-releasing factor receptor 1
Ligand
BDBM50113155
Substrate
Meas. Tech.
ChEMBL_50979 (CHEMBL663522)
Ki
526±n/a nM
Citation
 Wilson, DMTermin, APMao, LRamirez-Weinhouse, MMMolteni, VGrootenhuis, PDMiller, KKeim, SWise, G Arylamidrazones as novel corticotropin releasing factor receptor antagonists. J Med Chem 45:2123-6 (2002)  
Target
Name:
Corticotropin-releasing factor receptor 1
Synonyms:
CRF-R CRF1 CRFR1 CRH-R 1 CRHR1 Corticotropin-releasing factor receptor 1 (CRF-1) Corticotropin-releasing hormone receptor 1
Type:
Enzyme
Mol. Mass.:
50744.31
Organism:
Homo sapiens (Human)
Description:
P34998
Residue:
444
  
Inhibitor
Name:
BDBM50113155
Synonyms:
(1E)-N'-(2-methylphenyl)-2-oxo-N-phenylpropanehydrazonamide | CHEMBL65708
Type:
Small organic molecule
Emp. Form.:
C16H17N3O
Mol. Mass.:
267.3257
SMILES:
CC(=O)C(Nc1ccccc1)=NNc1ccccc1C
: