Target
Corticotropin-releasing factor receptor 1
Ligand
BDBM50113188
Substrate
Meas. Tech.
ChEMBL_50979 (CHEMBL663522)
Ki
66±n/a nM
Citation
 Wilson, DMTermin, APMao, LRamirez-Weinhouse, MMMolteni, VGrootenhuis, PDMiller, KKeim, SWise, G Arylamidrazones as novel corticotropin releasing factor receptor antagonists. J Med Chem 45:2123-6 (2002)  
Target
Name:
Corticotropin-releasing factor receptor 1
Synonyms:
CRF-R CRF1 CRFR1 CRH-R 1 CRHR1 Corticotropin-releasing factor receptor 1 (CRF-1) Corticotropin-releasing hormone receptor 1
Type:
Enzyme
Mol. Mass.:
50744.31
Organism:
Homo sapiens (Human)
Description:
P34998
Residue:
444
  
Inhibitor
Name:
BDBM50113188
Synonyms:
(1E)-N-(3-ethynylphenyl)-2-oxo-N'-[2-(trifluoromethyl)phenyl]propanehydrazonamide | CHEMBL67438
Type:
Small organic molecule
Emp. Form.:
C18H14F3N3O
Mol. Mass.:
345.3185
SMILES:
CC(=O)C(Nc1cccc(c1)C#C)=NNc1ccccc1C(F)(F)F
: