Target
Corticotropin-releasing factor receptor 1
Ligand
BDBM50113206
Substrate
Meas. Tech.
ChEMBL_50979 (CHEMBL663522)
Ki
115±n/a nM
Citation
 Wilson, DMTermin, APMao, LRamirez-Weinhouse, MMMolteni, VGrootenhuis, PDMiller, KKeim, SWise, G Arylamidrazones as novel corticotropin releasing factor receptor antagonists. J Med Chem 45:2123-6 (2002)  
Target
Name:
Corticotropin-releasing factor receptor 1
Synonyms:
CRF-R CRF1 CRFR1 CRH-R 1 CRHR1 Corticotropin-releasing factor receptor 1 (CRF-1) Corticotropin-releasing hormone receptor 1
Type:
Enzyme
Mol. Mass.:
50744.31
Organism:
Homo sapiens (Human)
Description:
P34998
Residue:
444
  
Inhibitor
Name:
BDBM50113206
Synonyms:
(1E)-N'-(2-chlorophenyl)-N-(3-methylphenyl)-2-oxopropanehydrazonamide | CHEMBL66950
Type:
Small organic molecule
Emp. Form.:
C16H16ClN3O
Mol. Mass.:
301.771
SMILES:
CC(=O)C(Nc1cccc(C)c1)=NNc1ccccc1Cl
: