Target
5-hydroxytryptamine receptor 2A
Ligand
BDBM50113326
Substrate
Meas. Tech.
ChEMBL_2305 (CHEMBL617090)
Ki
9.54±n/a nM
Citation
 Fu, XTan, PZKula, NSBaldessarini, RTamagnan, GInnis, RBBaldwin, RM Synthesis, receptor potency, and selectivity of halogenated diphenylpiperidines as serotonin 5-HT2A ligands for PET or SPECT brain imaging. J Med Chem 45:2319-24 (2002)  
Target
Name:
5-hydroxytryptamine receptor 2A
Synonyms:
5-HT-2 5-HT2A 5-hydroxytryptamine receptor 2A (5HT-2A) 5HT2A_HUMAN HTR2A | Serotonin receptor 2A
Type:
undefined
Mol. Mass.:
52607.65
Organism:
Homo sapiens (Human)
Description:
P28223
Residue:
471
  
Inhibitor
Name:
BDBM50113326
Synonyms:
(4-Fluoro-phenyl)-{1-[2-(4-fluoro-phenyl)-ethyl]-piperidin-4-yl}-methanone | CHEMBL78218
Type:
Small organic molecule
Emp. Form.:
C20H21F2NO
Mol. Mass.:
329.3836
SMILES:
Fc1ccc(CCN2CCC(CC2)C(=O)c2ccc(F)cc2)cc1
: