Target
D(2) dopamine receptor
Ligand
BDBM50113326
Substrate
Meas. Tech.
ChEMBL_62095 (CHEMBL674975)
Ki
453.0±n/a nM
Citation
 Fu, XTan, PZKula, NSBaldessarini, RTamagnan, GInnis, RBBaldwin, RM Synthesis, receptor potency, and selectivity of halogenated diphenylpiperidines as serotonin 5-HT2A ligands for PET or SPECT brain imaging. J Med Chem 45:2319-24 (2002)  
Target
Name:
D(2) dopamine receptor
Synonyms:
DOPAMINE D2 DOPAMINE D2 Short Dopamine D2 receptor Drd2
Type:
G Protein-Coupled Receptor (GPCR)
Mol. Mass.:
50931.60
Organism:
Rattus norvegicus (rat)
Description:
P61169
Residue:
444
  
Inhibitor
Name:
BDBM50113326
Synonyms:
(4-Fluoro-phenyl)-{1-[2-(4-fluoro-phenyl)-ethyl]-piperidin-4-yl}-methanone | CHEMBL78218
Type:
Small organic molecule
Emp. Form.:
C20H21F2NO
Mol. Mass.:
329.3836
SMILES:
Fc1ccc(CCN2CCC(CC2)C(=O)c2ccc(F)cc2)cc1
: