Target
5-hydroxytryptamine receptor 2C
Ligand
BDBM50113326
Substrate
Meas. Tech.
ChEMBL_2723 (CHEMBL617283)
Ki
493.0±n/a nM
Citation
 Fu, XTan, PZKula, NSBaldessarini, RTamagnan, GInnis, RBBaldwin, RM Synthesis, receptor potency, and selectivity of halogenated diphenylpiperidines as serotonin 5-HT2A ligands for PET or SPECT brain imaging. J Med Chem 45:2319-24 (2002)  
Target
Name:
5-hydroxytryptamine receptor 2C
Synonyms:
5-HT-1C 5-HT1C 5-HT2C-INI 5-HTR2C 5-hydroxytryptamine receptor 2C (5-HT-2C) 5HT-1C HTR1C Serotonin (5-HT3) receptor Serotonin Receptor 2C
Type:
G Protein-Coupled Receptor (GPCR)
Mol. Mass.:
51836.79
Organism:
Homo sapiens (Human)
Description:
P28335
Residue:
458
  
Inhibitor
Name:
BDBM50113326
Synonyms:
(4-Fluoro-phenyl)-{1-[2-(4-fluoro-phenyl)-ethyl]-piperidin-4-yl}-methanone | CHEMBL78218
Type:
Small organic molecule
Emp. Form.:
C20H21F2NO
Mol. Mass.:
329.3836
SMILES:
Fc1ccc(CCN2CCC(CC2)C(=O)c2ccc(F)cc2)cc1
: