Target
cAMP-specific 3',5'-cyclic phosphodiesterase 4A
Ligand
BDBM50113393
Substrate
Meas. Tech.
ChEBML_155041
IC50
19±n/a nM
Citation
 Alexander, RPWarrellow, GJEaton, MABoyd, ECHead, JCPorter, JRBrown, JAReuberson, JTHutchinson, BTurner, PBoyce, BBarnes, DMason, BCannell, ATaylor, RJZomaya, AMillican, ALeonard, JMorphy, RWales, MPerry, MAllen, RAGozzard, NHughes, BHiggs, G CDP840. A prototype of a novel class of orally active anti-inflammatory phosphodiesterase 4 inhibitors. Bioorg Med Chem Lett 12:1451-6 (2002)  
Target
Name:
cAMP-specific 3',5'-cyclic phosphodiesterase 4A
Synonyms:
3',5'-cyclic phosphodiesterase PDE46 PDE4A_HUMAN Phosphodiesterase 4A | Phosphodiesterase 4A (PDE4)
Type:
Enzyme
Mol. Mass.:
98113.27
Organism:
Homo sapiens (Human)
Description:
P27815
Residue:
886
  
Inhibitor
Name:
BDBM50113393
Synonyms:
1-{3-[1-((R)-3-Cyclopentyloxy-4-methoxy-phenyl)-2-pyridin-4-yl-ethyl]-phenyl}-3-methyl-urea | CHEMBL287377
Type:
Small organic molecule
Emp. Form.:
C27H31N3O3
Mol. Mass.:
445.5533
SMILES:
CNC(=O)Nc1cccc(c1)[C@@H](Cc1ccncc1)c1ccc(OC)c(OC2CCCC2)c1
: