Target
Integrin alpha-4/beta-1
Ligand
BDBM50116998
Substrate
Meas. Tech.
ChEMBL_213408 (CHEMBL878745)
IC50
0.290000±n/a nM
Citation
 Sidduri, ATilley, JWHull, KLou, JPKaplan, GSheffron, AChen, LCampbell, RGuthrie, RHuang, TNHuby, NRowan, KSchwinge, VRenzetti, LM N-Cycloalkanoyl-L-phenylalanine derivatives as VCAM/VLA-4 antagonists. Bioorg Med Chem Lett 12:2475-8 (2002)  
Target
Name:
Integrin alpha-4/beta-1
Synonyms:
Fibronectin receptor beta/Integrin alpha-4 | Integrin alpha-4/beta-1
Type:
Mol. Mass.:
Description:
ASSAY_ID of EBI is 88912
Components:
This complex has 2 components.
Component 1
Name:
Integrin beta-1
Synonyms:
CD_antigen=CD29 Fibronectin receptor beta GPIIA ITGB1 MDF2 | MSK12
Type:
Enzyme
Mol. Mass.:
88400.38
Organism:
Homo sapiens (Human)
Description:
P05556
Residue:
798
  
Component 2
Name:
Integrin alpha-4
Synonyms:
CD49 antigen-like family member D CD49d antigen ITA4_HUMAN Integrin alpha-4 Integrin alpha-IV VLA-4 integrin alpha 4 precursor | integrin alpha-4 precursor
Type:
Membrane Protein
Mol. Mass.:
114897.35
Organism:
Homo sapiens (Human)
Description:
P13612
Residue:
1032
  
Inhibitor
Name:
BDBM50116998
Synonyms:
(S)-3-[4-(2,6-Dichloro-benzoylamino)-phenyl]-2-{[1-(2-methylsulfanyl-ethyl)-cyclopentanecarbonyl]-amino}-propionic acid | CHEMBL310825
Type:
Small organic molecule
Emp. Form.:
C25H28Cl2N2O4S
Mol. Mass.:
523.472
SMILES:
CSCCC1(CCCC1)C(=O)N[C@@H](Cc1ccc(NC(=O)c2c(Cl)cccc2Cl)cc1)C(O)=O
: