Target
C-C chemokine receptor type 5
Ligand
BDBM50119340
Substrate
Meas. Tech.
ChEMBL_39511 (CHEMBL654808)
IC50
6±n/a nM
Citation
 Lynch, CLHale, JJBudhu, RJGentry, ALMills, SGChapman, KTMacCoss, MMalkowitz, LSpringer, MSGould, SLDeMartino, JASiciliano, SJCascieri, MACarella, ACarver, GHolmes, KSchleif, WADanzeisen, RHazuda, DKessler, JLineberger, JMiller, MEmini, EA 1,3,4-Trisubstituted pyrrolidine CCR5 receptor antagonists. Part 4: synthesis of N-1 acidic functionality affording analogues with enhanced antiviral activity against HIV. Bioorg Med Chem Lett 12:3001-4 (2002)  
Target
Name:
C-C chemokine receptor type 5
Synonyms:
C-C CKR-5 CC-CKR-5 CCR5 CCR5_HUMAN CHEMR13 HIV-1 fusion coreceptor
Type:
Enzyme
Mol. Mass.:
40540.21
Organism:
Homo sapiens (Human)
Description:
P51681
Residue:
352
  
Inhibitor
Name:
BDBM50119340
Synonyms:
2-((3S,4S)-3-((4-hydroxy-4-(3-phenylpropyl)piperidin-1-yl)methyl)-4-phenylpyrrolidin-1-yl)acetic acid CHEMBL102674
Type:
Small organic molecule
Emp. Form.:
C27H36N2O3
Mol. Mass.:
436.5863
SMILES:
OC(=O)CN1C[C@H](CN2CCC(O)(CCCc3ccccc3)CC2)[C@H](C1)c1ccccc1
: