Target
Transitional endoplasmic reticulum ATPase
Ligand
BDBM50558084
Substrate
Meas. Tech.
ChEMBL_2061776 (CHEMBL4717029)
Ki
740±n/a nM
Citation
 Alverez, CBulfer, SLChakrasali, RChimenti, MSDeshaies, RJGreen, NKelly, MLaPorte, MGLewis, TSLiang, MMoore, WJNeitz, RJPeshkov, VAWalters, MAZhang, FArkin, MRWipf, PHuryn, DM Allosteric Indole Amide Inhibitors of p97: Identification of a Novel Probe of the Ubiquitin Pathway. ACS Med Chem Lett 7:182-7 (2016)  
Target
Name:
Transitional endoplasmic reticulum ATPase
Synonyms:
TERA_HUMAN VCP Valosin-containing protein
Type:
Enzyme
Mol. Mass.:
89300.63
Organism:
Homo sapiens (Human)
Description:
P55072
Residue:
806
  
Inhibitor
Name:
BDBM50558084
Synonyms:
CHEMBL4799933
Type:
Small organic molecule
Emp. Form.:
C15H14N4O
Mol. Mass.:
266.2979
SMILES:
Cc1cc2cc(NC(=O)c3cccnc3N)ccc2[nH]1
: