Target
Fibroblast growth factor receptor 4
Ligand
BDBM209275
Substrate
Meas. Tech.
ChEMBL_2068061 (CHEMBL4723314)
IC50
0.700000±n/a nM
Citation
 Fairhurst, RAKnoepfel, TBuschmann, NLeblanc, CMah, RTodorov, MNimsgern, PRipoche, SNiklaus, MWarin, NLuu, VHMadoerin, MWirth, JGraus-Porta, DWeiss, AKiffe, MWartmann, MKinyamu-Akunda, JSterker, DStamm, CAdler, FBuhles, ASchadt, HCouttet, PBlank, JGaluba, ITrappe, JVoshol, JOstermann, NZou, CBerghausen, JDel Rio Espinola, AJahnke, WFuret, P Discovery of Roblitinib (FGF401) as a Reversible-Covalent Inhibitor of the Kinase Activity of Fibroblast Growth Factor Receptor 4. J Med Chem 63:12542-12573 (2020)  
Target
Name:
Fibroblast growth factor receptor 4
Synonyms:
CD_antigen: CD334 FGFR4 FGFR4 Fibroblast growth factor receptor JK2 TKF
Type:
Protein
Mol. Mass.:
87957.45
Organism:
Homo sapiens (Human)
Description:
P22455
Residue:
802
  
Inhibitor
Name:
BDBM209275
Synonyms:
US9266883, 33
Type:
Small organic molecule
Emp. Form.:
C19H19N5O3
Mol. Mass.:
365.3859
SMILES:
CC(C)Oc1cc(NC(=O)N2CCCc3ccc(C=O)nc23)ncc1C#N
: