Target
Fibroblast growth factor receptor 4
Ligand
BDBM209349
Substrate
Meas. Tech.
ChEMBL_2068061 (CHEMBL4723314)
IC50
0.300000±n/a nM
Citation
 Fairhurst, RAKnoepfel, TBuschmann, NLeblanc, CMah, RTodorov, MNimsgern, PRipoche, SNiklaus, MWarin, NLuu, VHMadoerin, MWirth, JGraus-Porta, DWeiss, AKiffe, MWartmann, MKinyamu-Akunda, JSterker, DStamm, CAdler, FBuhles, ASchadt, HCouttet, PBlank, JGaluba, ITrappe, JVoshol, JOstermann, NZou, CBerghausen, JDel Rio Espinola, AJahnke, WFuret, P Discovery of Roblitinib (FGF401) as a Reversible-Covalent Inhibitor of the Kinase Activity of Fibroblast Growth Factor Receptor 4. J Med Chem 63:12542-12573 (2020)  
Target
Name:
Fibroblast growth factor receptor 4
Synonyms:
CD_antigen: CD334 FGFR4 FGFR4 Fibroblast growth factor receptor JK2 TKF
Type:
Protein
Mol. Mass.:
87957.45
Organism:
Homo sapiens (Human)
Description:
P22455
Residue:
802
  
Inhibitor
Name:
BDBM209349
Synonyms:
US9266883, 148
Type:
Small organic molecule
Emp. Form.:
C24H29N7O5
Mol. Mass.:
495.531
SMILES:
COCCNc1cc(NC(=O)N2CCCc3cc(CN(C)C(=O)COC)c(C=O)nc23)ncc1C#N
: