Target
C-C chemokine receptor type 5
Ligand
BDBM50121831
Substrate
Meas. Tech.
ChEBML_49693
IC50
0.500000±n/a nM
Citation
 Lynch, CLWilloughby, CAHale, JJHolson, EJBudhu, RJGentry, ALRosauer, KGCaldwell, CGChen, PMills, SGMacCoss, MBerk, SChen, LChapman, KTMalkowitz, LSpringer, MSGould, SLDeMartino, JASiciliano, SJCascieri, MACarella, ACarver, GHolmes, KSchleif, WADanzeisen, RHazuda, DKessler, JLineberger, JMiller, MEmini, EA 1,3,4-Trisubstituted pyrrolidine CCR5 receptor antagonists: modifications of the arylpropylpiperidine side chains. Bioorg Med Chem Lett 13:119-23 (2002)  
Target
Name:
C-C chemokine receptor type 5
Synonyms:
C-C CKR-5 CC-CKR-5 CCR5 CCR5_HUMAN CHEMR13 HIV-1 fusion coreceptor
Type:
Enzyme
Mol. Mass.:
40540.21
Organism:
Homo sapiens (Human)
Description:
P51681
Residue:
352
  
Inhibitor
Name:
BDBM50121831
Synonyms:
(R)-3-Cyclobutyl-2-[(S)-3-{4-[2-(4-fluoro-benzenesulfinyl)-ethyl]-piperidin-1-ylmethyl}-4-(3-fluoro-phenyl)-pyrrolidin-1-yl]-propionic acid | CHEMBL278117
Type:
Small organic molecule
Emp. Form.:
C31H40F2N2O3S
Mol. Mass.:
558.723
SMILES:
OC(=O)[C@@H](CC1CCC1)N1C[C@H](CN2CCC(CCS(=O)c3ccc(F)cc3)CC2)[C@H](C1)c1cccc(F)c1
: