Target
C-C chemokine receptor type 5
Ligand
BDBM50121824
Substrate
Meas. Tech.
ChEBML_49693
IC50
0.800000±n/a nM
Citation
 Lynch, CLWilloughby, CAHale, JJHolson, EJBudhu, RJGentry, ALRosauer, KGCaldwell, CGChen, PMills, SGMacCoss, MBerk, SChen, LChapman, KTMalkowitz, LSpringer, MSGould, SLDeMartino, JASiciliano, SJCascieri, MACarella, ACarver, GHolmes, KSchleif, WADanzeisen, RHazuda, DKessler, JLineberger, JMiller, MEmini, EA 1,3,4-Trisubstituted pyrrolidine CCR5 receptor antagonists: modifications of the arylpropylpiperidine side chains. Bioorg Med Chem Lett 13:119-23 (2002)  
Target
Name:
C-C chemokine receptor type 5
Synonyms:
C-C CKR-5 CC-CKR-5 CCR5 CCR5_HUMAN CHEMR13 HIV-1 fusion coreceptor
Type:
Enzyme
Mol. Mass.:
40540.21
Organism:
Homo sapiens (Human)
Description:
P51681
Residue:
352
  
Inhibitor
Name:
BDBM50121824
Synonyms:
(R)-2-((S)-3-(3-Fluoro-phenyl)-4-{4-[2-(4-fluoro-phenylsulfanyl)-ethyl]-piperidin-1-ylmethyl}-pyrrolidin-1-yl)-3-methyl-butyric acid | CHEMBL281176
Type:
Small organic molecule
Emp. Form.:
C29H38F2N2O2S
Mol. Mass.:
516.686
SMILES:
CC(C)[C@@H](N1C[C@H](CN2CCC(CCSc3ccc(F)cc3)CC2)[C@H](C1)c1cccc(F)c1)C(O)=O
: