Target
C-C chemokine receptor type 5
Ligand
BDBM50121825
Substrate
Meas. Tech.
ChEBML_49693
IC50
1.5±n/a nM
Citation
 Lynch, CLWilloughby, CAHale, JJHolson, EJBudhu, RJGentry, ALRosauer, KGCaldwell, CGChen, PMills, SGMacCoss, MBerk, SChen, LChapman, KTMalkowitz, LSpringer, MSGould, SLDeMartino, JASiciliano, SJCascieri, MACarella, ACarver, GHolmes, KSchleif, WADanzeisen, RHazuda, DKessler, JLineberger, JMiller, MEmini, EA 1,3,4-Trisubstituted pyrrolidine CCR5 receptor antagonists: modifications of the arylpropylpiperidine side chains. Bioorg Med Chem Lett 13:119-23 (2002)  
Target
Name:
C-C chemokine receptor type 5
Synonyms:
C-C CKR-5 CC-CKR-5 CCR5 CCR5_HUMAN CHEMR13 HIV-1 fusion coreceptor
Type:
Enzyme
Mol. Mass.:
40540.21
Organism:
Homo sapiens (Human)
Description:
P51681
Residue:
352
  
Inhibitor
Name:
BDBM50121825
Synonyms:
(2R)-3-cyclopropyl-2-((3S,4S)-3-(3-fluorophenyl)-4-((4-(3-(4-fluorophenyl)-4-methoxy-4-oxobutyl)piperidin-1-yl)methyl)pyrrolidin-1-yl)propanoic acid CHEMBL283788
Type:
Small organic molecule
Emp. Form.:
C33H42F2N2O4
Mol. Mass.:
568.6944
SMILES:
COC(=O)C(CCC1CCN(C[C@H]2CN(C[C@@H]2c2cccc(F)c2)[C@H](CC2CC2)C(O)=O)CC1)c1ccc(F)cc1
: