Target
Monoglyceride lipase
Ligand
BDBM50531972
Substrate
Meas. Tech.
ChEMBL_2077554 (CHEMBL4733345)
IC50
81±n/a nM
Citation
 Granchi, CBononi, GFerrisi, RGori, EMantini, GGlasmacher, SPoli, GPalazzolo, SCaligiuri, IRizzolio, FCanzonieri, VPerin, TGertsch, JSodi, AGiovannetti, EMacchia, MMinutolo, FTuccinardi, TChicca, A Design, synthesis and biological evaluation of second-generation benzoylpiperidine derivatives as reversible monoacylglycerol lipase (MAGL) inhibitors. Eur J Med Chem 209:0 (2021)  
Target
Name:
Monoglyceride lipase
Synonyms:
HU-K5 Lysophospholipase-like MGL MGLL_HUMAN
Type:
Hydrolase
Mol. Mass.:
33264.56
Organism:
Homo sapiens (Human)
Description:
Human recombinant MGL (Cayman Chemical, cat# 10008354).
Residue:
303
  
Inhibitor
Name:
BDBM50531972
Synonyms:
CHEMBL4536045
Type:
Small organic molecule
Emp. Form.:
C22H24FNO3
Mol. Mass.:
369.4293
SMILES:
CC(C)c1ccc(cc1)C(=O)C1CCN(CC1)C(=O)c1cc(O)ccc1F
: